Reaction Details
TargetAdenosine receptor A2a
LigandBDBM50003226
Substrate/Competitorn/a
Meas. Tech.ChEMBL_471788 (CHEMBL939996)
Ki 398±n/a nM
Citation Stefanachi, ABrea, JMCadavid, MICenteno, NBEsteve, CLoza, MIMartinez, ANieto, RRaviña, ESanz, FSegarra, VSotelo, EVidal, BCarotti, A 1-, 3- and 8-substituted-9-deazaxanthines as potent and selective antagonists at the human A2B adenosine receptor. Bioorg Med Chem16:2852-69 (2008) 
 
Adenosine receptor A2a
Name:Adenosine receptor A2a
Type:G Protein-Coupled Receptor (GPCR)
Mol. Mass.:44716.46
Organism:Homo sapiens (Human)
Description:P29274
Residue:412
BDBM50003226
NameBDBM50003226
Synonyms:CHEMBL261056
TypeSmall organic molecule
Emp. Form.C26H26ClN5O4
Mol. Mass.507.969
SMILESCn1c2cc([nH]c2c(=O)n(C)c1=O)-c1ccc(OCC(=O)N2CCN(CC2)c2ccc(Cl)cc2)cc1