Reaction Details
TargetRibonuclease pancreatic
LigandBDBM50233301
Substrate/Competitorn/a
Meas. Tech.ChEMBL_471807 (CHEMBL940091)
Ki 103000±n/a nM
Citation Ghosh, KSDebnath, JDutta, PSahoo, BKDasgupta, S Exploring the potential of 3'-O-carboxy esters of thymidine as inhibitors of ribonuclease A and angiogenin. Bioorg Med Chem16:2819-28 (2008) 
 
Ribonuclease pancreatic
Name:Ribonuclease pancreatic
Type:Protein
Mol. Mass.:17653.66
Organism:Homo sapiens (Human)
Description:n/a
Residue:156
BDBM50233301
NameBDBM50233301
Synonyms:CHEMBL258728 | cytidine-3'-monophosphate
TypeSmall organic molecule
Emp. Form.C9H14N3O8P
Mol. Mass.323.1965
SMILESNc1ccn([C@@H]2O[C@H](CO)[C@@H](OP(O)(O)=O)[C@H]2O)c(=O)n1