Reaction Details
TargetRibonuclease pancreatic
LigandBDBM50375420
Substrate/Competitorn/a
Meas. Tech.ChEMBL_471807 (CHEMBL940091)
Ki 42000±n/a nM
Citation Ghosh, KSDebnath, JDutta, PSahoo, BKDasgupta, S Exploring the potential of 3'-O-carboxy esters of thymidine as inhibitors of ribonuclease A and angiogenin. Bioorg Med Chem16:2819-28 (2008) 
 
Ribonuclease pancreatic
Name:Ribonuclease pancreatic
Type:Protein
Mol. Mass.:17653.66
Organism:Homo sapiens (Human)
Description:n/a
Residue:156
BDBM50375420
NameBDBM50375420
Synonyms:CHEMBL266234
TypeSmall organic molecule
Emp. Form.C12H16N2O6
Mol. Mass.284.2652
SMILESCC(=O)O[C@H]1C[C@@H](O[C@@H]1CO)n1cc(C)c(=O)[nH]c1=O