Reaction Details
Target5-hydroxytryptamine receptor 2A
LigandBDBM50375452
Substrate/Competitorn/a
Meas. Tech.ChEMBL_472647 (CHEMBL921963)
Ki 8.7±n/a nM
Citation Shimada, IMaeno, KKazuta, KKubota, HKimizuka, TKimura, YHatanaka, KNaitou, YWanibuchi, FSakamoto, STsukamoto, S Synthesis and structure-activity relationships of a series of substituted 2-(1H-furo[2,3-g]indazol-1-yl)ethylamine derivatives as 5-HT2C receptor agonists. Bioorg Med Chem16:1966-82 (2008) 
 
5-hydroxytryptamine receptor 2A
Name:5-hydroxytryptamine receptor 2A
Type:undefined
Mol. Mass.:52607.65
Organism:Homo sapiens (Human)
Description:P28223
Residue:471
BDBM50375452
NameBDBM50375452
Synonyms:CHEMBL262092
TypeSmall organic molecule
Emp. Form.C13H15N3O2
Mol. Mass.245.2771
SMILESCOc1nn(C[C@H](C)N)c2c1ccc1occc21