Reaction Details
Target5-hydroxytryptamine receptor 2B
LigandBDBM50144841
Substrate/Competitorn/a
Meas. Tech.ChEMBL_472651 (CHEMBL921967)
EC50 2.4±n/a nM
Citation Shimada, IMaeno, KKazuta, KKubota, HKimizuka, TKimura, YHatanaka, KNaitou, YWanibuchi, FSakamoto, STsukamoto, S Synthesis and structure-activity relationships of a series of substituted 2-(1H-furo[2,3-g]indazol-1-yl)ethylamine derivatives as 5-HT2C receptor agonists. Bioorg Med Chem16:1966-82 (2008) 
 
5-hydroxytryptamine receptor 2B
Name:5-hydroxytryptamine receptor 2B
Type:G Protein-Coupled Receptor (GPCR)
Mol. Mass.:54312.47
Organism:Homo sapiens (Human)
Description:Receptor binding assays were performed using human clone stably expressed in CHO cells.
Residue:481
BDBM50144841
NameBDBM50144841
Synonyms:(S)-1-(6-chloro-5-fluoro-1H-indol-1-yl)propan-2-amine CHEMBL76781 Ro-600175
TypeSmall organic molecule
Emp. Form.C11H12ClFN2
Mol. Mass.226.678
SMILESC[C@H](N)Cn1ccc2cc(F)c(Cl)cc12