Reaction Details
TargetAdenosine receptor A1
LigandBDBM50375499
Substrate/Competitorn/a
Meas. Tech.ChEMBL_472687 (CHEMBL922854)
Ki 2.8±n/a nM
Citation van Veldhoven, JPChang, LCvon Frijtag Drabbe Künzel, JKMulder-Krieger, TStruensee-Link, RBeukers, MWBrussee, JIJzerman, AP A new generation of adenosine receptor antagonists: from di- to trisubstituted aminopyrimidines. Bioorg Med Chem16:2741-52 (2008) 
 
Adenosine receptor A1
Name:Adenosine receptor A1
Type:G Protein-Coupled Receptor (GPCR)
Mol. Mass.:36520.92
Organism:Homo sapiens (Human)
Description:P30542
Residue:326
BDBM50375499
NameBDBM50375499
Synonyms:CHEMBL259319
TypeSmall organic molecule
Emp. Form.C24H20N4O3
Mol. Mass.412.4406
SMILESO=C(Nc1nc(-c2ccccc2)c(C#N)c(n1)-c1ccc2OCOc2c1)C1CCCC1