Reaction Details
TargetAdenosine receptor A1
LigandBDBM50375500
Substrate/Competitorn/a
Meas. Tech.ChEMBL_472687 (CHEMBL922854)
Ki 1.8±n/a nM
Citation van Veldhoven, JPChang, LCvon Frijtag Drabbe Künzel, JKMulder-Krieger, TStruensee-Link, RBeukers, MWBrussee, JIJzerman, AP A new generation of adenosine receptor antagonists: from di- to trisubstituted aminopyrimidines. Bioorg Med Chem16:2741-52 (2008) 
 
Adenosine receptor A1
Name:Adenosine receptor A1
Type:G Protein-Coupled Receptor (GPCR)
Mol. Mass.:36520.92
Organism:Homo sapiens (Human)
Description:P30542
Residue:326
BDBM50375500
NameBDBM50375500
Synonyms:CHEMBL259607
TypeSmall organic molecule
Emp. Form.C18H12N4O2
Mol. Mass.316.3135
SMILESNc1nc(-c2ccccc2)c(C#N)c(n1)-c1ccc2OCOc2c1