Reaction Details
TargetHistone deacetylase 1
LigandBDBM50154337
Substrate/Competitorn/a
Meas. Tech.ChEMBL_472925 (CHEMBL921168)
IC50 0.4±n/a nM
Citation Schäfer, SSaunders, LEliseeva, EVelena, AJung, MSchwienhorst, AStrasser, ADickmanns, AFicner, RSchlimme, SSippl, WVerdin, EJung, M Phenylalanine-containing hydroxamic acids as selective inhibitors of class IIb histone deacetylases (HDACs). Bioorg Med Chem16:2011-33 (2008) 
 
Histone deacetylase 1
Name:Histone deacetylase 1
Type:Enzyme
Mol. Mass.:55090.27
Organism:Homo sapiens (Human)
Description:Q13547
Residue:482
BDBM50154337
NameBDBM50154337
Synonyms:6-((5S,11S,13aR)-5-benzyl-8,8-dimethyl-4,7,10,13-tetraoxo-tetradecahydro-3a,6,9,12-tetraaza-cyclopentacyclododecen-11-yl)-hexanoic acid hydroxyamide CHEMBL360194
TypeSmall organic molecule
Emp. Form.C26H37N5O6
Mol. Mass.515.6019
SMILESCC1(C)NC(=O)[C@H](CCCCCC(=O)NO)NC(=O)[C@H]2CCCN2C(=O)[C@H](Cc2ccccc2)NC1=O