Reaction Details
TargetProstaglandin G/H synthase 2
LigandBDBM50207446
Substrate/Competitorn/a
Meas. Tech.ChEMBL_473084 (CHEMBL921796)
IC50 140±n/a nM
Citation Blobaum, ALMarnett, LJ Molecular determinants for the selective inhibition of cyclooxygenase-2 by lumiracoxib. J Biol Chem282:16379-90 (2007) 
 
Prostaglandin G/H synthase 2
Name:Prostaglandin G/H synthase 2
Type:Enzyme
Mol. Mass.:69003.89
Organism:Homo sapiens (Human)
Description:Recombinant Cox-2 provided by Cayman (Cayman Chemical Co.,Ann Arbor, MI).
Residue:604
BDBM50207446
NameBDBM50207446
Synonyms:2-(2-(2-chloro-6-fluorophenylamino)-5-methylphenyl)acetic acid | CHEMBL404108
TypeSmall organic molecule
Emp. Form.C15H13ClFNO2
Mol. Mass.293.721
SMILESCc1ccc(Nc2c(F)cccc2Cl)c(CC(O)=O)c1