Reaction Details
TargetProstaglandin G/H synthase 2
LigandBDBM50375607
Substrate/Competitorn/a
Meas. Tech.ChEMBL_473081 (CHEMBL921793)
IC50 63±n/a nM
Citation Blobaum, ALMarnett, LJ Molecular determinants for the selective inhibition of cyclooxygenase-2 by lumiracoxib. J Biol Chem282:16379-90 (2007) 
 
Prostaglandin G/H synthase 2
Name:Prostaglandin G/H synthase 2
Type:Protein
Mol. Mass.:69020.39
Organism:Mus musculus (Mouse)
Description:Q05769
Residue:604
BDBM50375607
NameBDBM50375607
Synonyms:CHEMBL259218
TypeSmall organic molecule
Emp. Form.C15H13Cl2NO2
Mol. Mass.310.175
SMILESCc1ccc(Nc2c(Cl)cccc2Cl)c(CC(O)=O)c1