Reaction Details
TargetProstaglandin G/H synthase 2
LigandBDBM50375606
Substrate/Competitorn/a
Meas. Tech.ChEMBL_473081 (CHEMBL921793)
IC50 35±n/a nM
Citation Blobaum, ALMarnett, LJ Molecular determinants for the selective inhibition of cyclooxygenase-2 by lumiracoxib. J Biol Chem282:16379-90 (2007) 
 
Prostaglandin G/H synthase 2
Name:Prostaglandin G/H synthase 2
Type:Protein
Mol. Mass.:69020.39
Organism:Mus musculus (Mouse)
Description:Q05769
Residue:604
BDBM50375606
NameBDBM50375606
Synonyms:CHEMBL76084
TypeSmall organic molecule
Emp. Form.C15H14ClNO2
Mol. Mass.275.73
SMILESCc1cccc(Cl)c1Nc1ccccc1CC(O)=O