Reaction Details
TargetProstaglandin G/H synthase 2
LigandBDBM13066
Substrate/Competitorn/a
Meas. Tech.ChEMBL_473081 (CHEMBL921793)
IC50 22±n/a nM
Citation Blobaum, ALMarnett, LJ Molecular determinants for the selective inhibition of cyclooxygenase-2 by lumiracoxib. J Biol Chem282:16379-90 (2007) 
 
Prostaglandin G/H synthase 2
Name:Prostaglandin G/H synthase 2
Type:Protein
Mol. Mass.:69020.39
Organism:Mus musculus (Mouse)
Description:Q05769
Residue:604
BDBM13066
NameBDBM13066
Synonyms:2-{2-[(2,6-dichlorophenyl)amino]phenyl}acetic acid Diclofenac US11478464, Compound Diclofenac {2-[(2,6-dichlorophenyl)amino]phenyl}acetic acid
TypeSmall organic molecule
Emp. Form.C14H11Cl2NO2
Mol. Mass.296.149
SMILESOC(=O)Cc1ccccc1Nc1c(Cl)cccc1Cl