Reaction Details
TargetVascular endothelial growth factor receptor 2
LigandBDBM50221556
Substrate/Competitorn/a
Meas. Tech.ChEMBL_473235 (CHEMBL932926)
IC50 1.7±n/a nM
Citation Palanki, MSAkiyama, HCampochiaro, PCao, JChow, CPDellamary, LDoukas, JFine, RGritzen, CHood, JDHu, SKachi, SKang, XKlebansky, BKousba, ALohse, DMak, CCMartin, MMcPherson, APathak, VPRenick, JSoll, RUmeda, NYee, SYokoi, KZeng, BZhu, HNoronha, G Development of prodrug 4-chloro-3-(5-methyl-3-{[4-(2-pyrrolidin-1-ylethoxy)phenyl]amino}-1,2,4-benzotriazin-7-yl)phenyl benzoate (TG100801): a topically administered therapeutic candidate in clinical trials for the treatment of age-related macular degeneration. J Med Chem51:1546-59 (2008) 
 
Vascular endothelial growth factor receptor 2
Name:Vascular endothelial growth factor receptor 2
Type:Receptor Tyrosine Kinase
Mol. Mass.:151510.97
Organism:Homo sapiens (Human)
Description:P35968
Residue:1356
BDBM50221556
NameBDBM50221556
Synonyms:4-chloro-3-(5-methyl-3-(4-(piperidin-4-ylsulfonyl)phenylamino)benzo[e][1,2,4]triazin-7-yl)phenol CHEMBL250625 US8481536, 617
TypeSmall organic molecule
Emp. Form.C25H24ClN5O3S
Mol. Mass.510.008
SMILESCc1cc(cc2nnc(Nc3ccc(cc3)S(=O)(=O)C3CCNCC3)nc12)-c1cc(O)ccc1Cl