Reaction Details
TargetTyrosine-protein kinase Yes
LigandBDBM50221553
Substrate/Competitorn/a
Meas. Tech.ChEMBL_473236 (CHEMBL932927)
IC50 1.3±n/a nM
Citation Palanki, MSAkiyama, HCampochiaro, PCao, JChow, CPDellamary, LDoukas, JFine, RGritzen, CHood, JDHu, SKachi, SKang, XKlebansky, BKousba, ALohse, DMak, CCMartin, MMcPherson, APathak, VPRenick, JSoll, RUmeda, NYee, SYokoi, KZeng, BZhu, HNoronha, G Development of prodrug 4-chloro-3-(5-methyl-3-{[4-(2-pyrrolidin-1-ylethoxy)phenyl]amino}-1,2,4-benzotriazin-7-yl)phenyl benzoate (TG100801): a topically administered therapeutic candidate in clinical trials for the treatment of age-related macular degeneration. J Med Chem51:1546-59 (2008) 
 
Tyrosine-protein kinase Yes
Name:Tyrosine-protein kinase Yes
Type:Protein
Mol. Mass.:60801.54
Organism:Homo sapiens (Human)
Description:P07947
Residue:543
BDBM50221553
NameBDBM50221553
Synonyms:4-(7-(2-chloro-5-hydroxyphenyl)-5-methylbenzo[e][1,2,4]triazin-3-ylamino)-N-(2-(pyrrolidin-1-yl)ethyl)benzenesulfonamide CHEMBL249821 US8481536, 603
TypeSmall organic molecule
Emp. Form.C26H27ClN6O3S
Mol. Mass.539.049
SMILESCc1cc(cc2nnc(Nc3ccc(cc3)S(=O)(=O)NCCN3CCCC3)nc12)-c1cc(O)ccc1Cl