Reaction Details
TargetTyrosine-protein kinase Yes
LigandBDBM50198782
Substrate/Competitorn/a
Meas. Tech.ChEMBL_473236 (CHEMBL932927)
IC50 10±n/a nM
Citation Palanki, MSAkiyama, HCampochiaro, PCao, JChow, CPDellamary, LDoukas, JFine, RGritzen, CHood, JDHu, SKachi, SKang, XKlebansky, BKousba, ALohse, DMak, CCMartin, MMcPherson, APathak, VPRenick, JSoll, RUmeda, NYee, SYokoi, KZeng, BZhu, HNoronha, G Development of prodrug 4-chloro-3-(5-methyl-3-{[4-(2-pyrrolidin-1-ylethoxy)phenyl]amino}-1,2,4-benzotriazin-7-yl)phenyl benzoate (TG100801): a topically administered therapeutic candidate in clinical trials for the treatment of age-related macular degeneration. J Med Chem51:1546-59 (2008) 
 
Tyrosine-protein kinase Yes
Name:Tyrosine-protein kinase Yes
Type:Protein
Mol. Mass.:60801.54
Organism:Homo sapiens (Human)
Description:P07947
Residue:543
BDBM50198782
NameBDBM50198782
Synonyms:([7-(2,6-dichloro-phenyl)-5-methyl-benzo[1,2,4]triazin-3-yl]-[4-(2-pyrrolidin-1-yl-ethoxy)-phenyl]-amine) 7-(2,6-dichlorophenyl)-5-methyl-N-[4-(2-pyrrolidin-1-ylethoxy)-phenyl]-1,2,4-benzotriazin-3-amine TG-100435 US8481536, 575
TypeSmall organic molecule
Emp. Form.C26H25Cl2N5O
Mol. Mass.494.416
SMILESCc1cc(cc2nnc(Nc3ccc(OCCN4CCCC4)cc3)nc12)-c1c(Cl)cccc1Cl