Reaction Details
TargetDual specificity mitogen-activated protein kinase kinase 2
LigandBDBM50072147
Substrate/Competitorn/a
Meas. Tech.ChEMBL_473714 (CHEMBL936811)
IC50 58±n/a nM
Citation Fedorov, OMarsden, BPogacic, VRellos, PMüller, SBullock, ANSchwaller, JSundström, MKnapp, S A systematic interaction map of validated kinase inhibitors with Ser/Thr kinases. Proc Natl Acad Sci U S A104:20523-8 (2007) 
 
Dual specificity mitogen-activated protein kinase kinase 2
Name:Dual specificity mitogen-activated protein kinase kinase 2
Type:Enzyme Catalytic Domain
Mol. Mass.:44423.61
Organism:Homo sapiens (Human)
Description:gi_13489054
Residue:400
BDBM50072147
NameBDBM50072147
Synonyms:(2Z,3Z)-2,3-bis(amino(2-aminophenylthio)methylene)succinonitrile 1,4-diamino-2,3-dicyano-1,4-bis[2-aminophenylthio]butadiene monoethanolate 2,3-Bis-[amino-(2-amino-phenylsulfanyl)-methylene]-succinonitrile 2-[1-Amino-1-(2-amino-phenylsulfanyl)-meth-(Z)-ylidene]-3-[1-amino-1-(2-amino-phenylsulfanyl)-meth-(E)-ylidene]-succinonitrile CHEMBL100473 U-0126
TypeSmall organic molecule
Emp. Form.C18H16N6S2
Mol. Mass.380.49
SMILESNc1ccccc1SC(=N)C(C#N)C(C#N)C(=N)Sc1ccccc1N