Reaction Details
TargetVascular endothelial growth factor receptor 1
LigandBDBM50375642
Substrate/Competitorn/a
Meas. Tech.ChEMBL_473674 (CHEMBL921718)
IC50 1±n/a nM
Citation Fedorov, OMarsden, BPogacic, VRellos, PMüller, SBullock, ANSchwaller, JSundström, MKnapp, S A systematic interaction map of validated kinase inhibitors with Ser/Thr kinases. Proc Natl Acad Sci U S A104:20523-8 (2007) 
 
Vascular endothelial growth factor receptor 1
Name:Vascular endothelial growth factor receptor 1
Type:Receptor Tyrosine Kinase
Mol. Mass.:150800.23
Organism:Homo sapiens (Human)
Description:P17948
Residue:1338
BDBM50375642
NameBDBM50375642
Synonyms:CHEMBL406381 | KRN-633
TypeSmall organic molecule
Emp. Form.C20H21ClN4O4
Mol. Mass.416.858
SMILESCCCNC(=O)Nc1ccc(Oc2ncnc3cc(OC)c(OC)cc23)cc1Cl