Reaction Details
TargetCalcium/calmodulin-dependent protein kinase type IV
LigandBDBM92455
Substrate/Competitorn/a
Meas. Tech.ChEMBL_473729 (CHEMBL936920)
IC50>31800±n/a nM
Citation Fedorov, OMarsden, BPogacic, VRellos, PMüller, SBullock, ANSchwaller, JSundström, MKnapp, S A systematic interaction map of validated kinase inhibitors with Ser/Thr kinases. Proc Natl Acad Sci U S A104:20523-8 (2007) 
 
Calcium/calmodulin-dependent protein kinase type IV
Name:Calcium/calmodulin-dependent protein kinase type IV
Type:PROTEIN
Mol. Mass.:51919.87
Organism:Homo sapiens (Human)
Description:ChEMBL_1459854
Residue:473
BDBM92455
NameBDBM92455
Synonyms:CHEMBL265470 | STO-609
TypeSmall organic molecule
Emp. Form.C19H10N2O3
Mol. Mass.314.2943
SMILESOC(=O)c1ccc2c3nc4ccccc4n3c(=O)c3cccc1c23