Reaction Details
TargetCyclin-dependent kinase 5 activator 1
LigandBDBM50005298
Substrate/Competitorn/a
Meas. Tech.ChEMBL_473638 (CHEMBL937655)
IC50 20±n/a nM
Citation Fedorov, OMarsden, BPogacic, VRellos, PMüller, SBullock, ANSchwaller, JSundström, MKnapp, S A systematic interaction map of validated kinase inhibitors with Ser/Thr kinases. Proc Natl Acad Sci U S A104:20523-8 (2007) 
 
Cyclin-dependent kinase 5 activator 1
Name:Cyclin-dependent kinase 5 activator 1
Type:Enzyme Subunit
Mol. Mass.:34077.43
Organism:Homo sapiens (Human)
Description:Q15078
Residue:307
BDBM50005298
NameBDBM50005298
Synonyms:CHEMBL337300
TypeSmall organic molecule
Emp. Form.C16H10IN3O2
Mol. Mass.403.174
SMILESOc1[nH]c2ccc(I)cc2c1-c1[nH]c2ccccc2c1N=O