Reaction Details
TargetCyclin-dependent kinase 6/G1/S-specific cyclin-D3
LigandBDBM5718
Substrate/Competitorn/a
Meas. Tech.ChEMBL_473690 (CHEMBL936789)
IC50>250000±n/a nM
Citation Fedorov, OMarsden, BPogacic, VRellos, PMüller, SBullock, ANSchwaller, JSundström, MKnapp, S A systematic interaction map of validated kinase inhibitors with Ser/Thr kinases. Proc Natl Acad Sci U S A104:20523-8 (2007) 
 
Cyclin-dependent kinase 6/G1/S-specific cyclin-D3
Name:Cyclin-dependent kinase 6/G1/S-specific cyclin-D3
Type:Protein
Mol. Mass.:n/a
Description:n/a
Components:This complex has 2 components.
Component 1
Name:Cyclin-dependent kinase 6
Synonyms:CDK6 CDKN6 Cyclin-dependent kinase 6 (CDK 6) | Serine/threonine-protein kinase PLSTIRE
Type:Enzyme Subunit
Mol. Mass.:36937.42
Organism:Homo sapiens (Human)
Description:Q00534
Residue:326
Component 2
Name:G1/S-specific cyclin-D3
Synonyms:CCND3 | CCND3_HUMAN
Type:Enzyme
Mol. Mass.:32521.90
Organism:Homo sapiens (Human)
Description:P30281
Residue:292
BDBM5718
NameBDBM5718
Synonyms:2,6,9-Trisubstituted purine deriv. 26 2-{[6-(benzylamino)-9-methyl-9H-purin-2-yl]amino}ethanol CHEMBL280074 purine deriv. 5
TypeSmall organic molecule
Emp. Form.C15H18N6O
Mol. Mass.298.343
SMILESCn1cnc2c(NCc3ccccc3)nc(NCCO)nc12