Reaction Details
TargetCalcium dependent protein kinase
LigandBDBM50045936
Substrate/Competitorn/a
Meas. Tech.ChEMBL_473784 (CHEMBL937050)
IC50 19000±n/a nM
Citation Fedorov, OMarsden, BPogacic, VRellos, PMüller, SBullock, ANSchwaller, JSundström, MKnapp, S A systematic interaction map of validated kinase inhibitors with Ser/Thr kinases. Proc Natl Acad Sci U S A104:20523-8 (2007) 
 
Calcium dependent protein kinase
Name:Calcium dependent protein kinase
Synonyms:n/a
Type:PROTEIN
Mol. Mass.:61386.18
Organism:Triticum aestivum
Description:ChEMBL_473784
Residue:548
BDBM50045936
NameBDBM50045936
TypeSmall organic molecule
Emp. Form.C14H12O4
Mol. Mass.244.2427
SMILESOc1cc(O)cc(\C=C\c2ccc(O)c(O)c2)c1