Reaction Details
TargetEphrin type-B receptor 3
LigandBDBM50205472
Substrate/Competitorn/a
Meas. Tech.ChEMBL_473696 (CHEMBL936795)
Ki>2000±n/a nM
Citation Fedorov, OMarsden, BPogacic, VRellos, PMüller, SBullock, ANSchwaller, JSundström, MKnapp, S A systematic interaction map of validated kinase inhibitors with Ser/Thr kinases. Proc Natl Acad Sci U S A104:20523-8 (2007) 
 
Ephrin type-B receptor 3
Name:Ephrin type-B receptor 3
Type:Protein
Mol. Mass.:110326.17
Organism:Homo sapiens (Human)
Description:P54753
Residue:998
BDBM50205472
NameBDBM50205472
Synonyms:(5Z)-5-(quinolin-6-ylmethylidene)-2-[(thiophen-2-ylmethyl)amino]-1,3-thiazol-4(5H)-one CHEMBL261644 | CHEMBL393929
TypeSmall organic molecule
Emp. Form.C18H13N3OS2
Mol. Mass.351.445
SMILESO=C1N=C(NCc2cccs2)SC1=Cc1ccc2ncccc2c1