Reaction Details
TargetC-C chemokine receptor type 2
LigandBDBM50375731
Substrate/Competitorn/a
Meas. Tech.ChEMBL_473977 (CHEMBL933958)
IC50 0.89±n/a nM
Citation Moree, WJKataoka, KRamirez-Weinhouse, MMShiota, TImai, MTsutsumi, TSudo, MEndo, NMuroga, YHada, TFanning, DSaunders, JKato, YMyers, PLTarby, CM Potent antagonists of the CCR2b receptor. Part 3: SAR of the (R)-3-aminopyrrolidine series. Bioorg Med Chem Lett18:1869-73 (2008) 
 
C-C chemokine receptor type 2
Name:C-C chemokine receptor type 2
Type:Enzyme
Mol. Mass.:41932.32
Organism:Homo sapiens (Human)
Description:P41597
Residue:374
BDBM50375731
NameBDBM50375731
Synonyms:CHEMBL271288
TypeSmall organic molecule
Emp. Form.C23H27F3N4O2
Mol. Mass.448.4813
SMILESCCc1ccc(CN2CC[C@H](C2)NC(=O)CNC(=O)c2cc(ccc2N)C(F)(F)F)cc1