Reaction Details
TargetC-C chemokine receptor type 2
LigandBDBM50375744
Substrate/Competitorn/a
Meas. Tech.ChEMBL_473977 (CHEMBL933958)
IC50 5.5±n/a nM
Citation Moree, WJKataoka, KRamirez-Weinhouse, MMShiota, TImai, MTsutsumi, TSudo, MEndo, NMuroga, YHada, TFanning, DSaunders, JKato, YMyers, PLTarby, CM Potent antagonists of the CCR2b receptor. Part 3: SAR of the (R)-3-aminopyrrolidine series. Bioorg Med Chem Lett18:1869-73 (2008) 
 
C-C chemokine receptor type 2
Name:C-C chemokine receptor type 2
Type:Enzyme
Mol. Mass.:41932.32
Organism:Homo sapiens (Human)
Description:P41597
Residue:374
BDBM50375744
NameBDBM50375744
Synonyms:CHEMBL402723
TypeSmall organic molecule
Emp. Form.C21H22F3N3O3
Mol. Mass.421.4129
SMILESOc1ccc(CN2CC[C@H](C2)NC(=O)CNC(=O)c2cccc(c2)C(F)(F)F)cc1