Reaction Details
TargetC-C chemokine receptor type 2
LigandBDBM50375722
Substrate/Competitorn/a
Meas. Tech.ChEMBL_473977 (CHEMBL933958)
IC50 8.8±n/a nM
Citation Moree, WJKataoka, KRamirez-Weinhouse, MMShiota, TImai, MTsutsumi, TSudo, MEndo, NMuroga, YHada, TFanning, DSaunders, JKato, YMyers, PLTarby, CM Potent antagonists of the CCR2b receptor. Part 3: SAR of the (R)-3-aminopyrrolidine series. Bioorg Med Chem Lett18:1869-73 (2008) 
 
C-C chemokine receptor type 2
Name:C-C chemokine receptor type 2
Type:Enzyme
Mol. Mass.:41932.32
Organism:Homo sapiens (Human)
Description:P41597
Residue:374
BDBM50375722
NameBDBM50375722
Synonyms:CHEMBL270435
TypeSmall organic molecule
Emp. Form.C22H26F3N5O3
Mol. Mass.465.4687
SMILESCOc1ccc(CN2CC[C@H](C2)NC(=O)CNC(=O)c2cc(ccc2N)C(F)(F)F)cc1N