Reaction Details
TargetGeranylgeranyl pyrophosphate synthase BTS1
LigandBDBM25288
Substrate/Competitorn/a
Meas. Tech.ChEMBL_474166 (CHEMBL938424)
Ki 110±n/a nM
Citation Guo, RTCao, RLiang, PHKo, TPChang, THHudock, MPJeng, WYChen, CKZhang, YSong, YKuo, CJYin, FOldfield, EWang, AH Bisphosphonates target multiple sites in both cis- and trans-prenyltransferases. Proc Natl Acad Sci U S A104:10022-7 (2007) 
 
Geranylgeranyl pyrophosphate synthase BTS1
Name:Geranylgeranyl pyrophosphate synthase BTS1
Type:Protein
Mol. Mass.:38647.44
Organism:Saccharomyces cerevisiae (Yeast)
Description:n/a
Residue:335
BDBM25288
NameBDBM25288
Synonyms:BPH-629 bisphosphonate, 8
TypeSmall organic molecule
Emp. Form.C20H18O8P2
Mol. Mass.448.2996
SMILESOC(Cc1cccc(c1)-c1cccc2c1oc1ccccc21)(P(O)(O)=O)P(O)(O)=O