Reaction Details
TargetGeranylgeranyl pyrophosphate synthase
LigandBDBM25289
Substrate/Competitorn/a
Meas. Tech.ChEMBL_474168 (CHEMBL938426)
Ki 110±n/a nM
Citation Guo, RTCao, RLiang, PHKo, TPChang, THHudock, MPJeng, WYChen, CKZhang, YSong, YKuo, CJYin, FOldfield, EWang, AH Bisphosphonates target multiple sites in both cis- and trans-prenyltransferases. Proc Natl Acad Sci U S A104:10022-7 (2007) 
 
Geranylgeranyl pyrophosphate synthase
Name:Geranylgeranyl pyrophosphate synthase
Type:Homooctamer; transferase
Mol. Mass.:34867.94
Organism:Homo sapiens (Human)
Description:Recombinant human GGPPS was cloned and expressed in E. coli.
Residue:300
BDBM25289
NameBDBM25289
Synonyms:bisphosphonate, 38 | {1-hydroxy-2-[3-(3-phenylphenyl)phenoxy]-1-phosphonoethyl}phosphonic acid
TypeSmall organic molecule
Emp. Form.C20H20O8P2
Mol. Mass.450.3155
SMILESOC(COc1cccc(c1)-c1cccc(c1)-c1ccccc1)(P(O)(O)=O)P(O)(O)=O