Reaction Details
TargetBeta-lactamase TEM
LigandBDBM50021954
Substrate/Competitorn/a
Meas. Tech.ChEMBL_474301 (CHEMBL937013)
IC50 7300±n/a nM
Citation Papagiannitsis, CCLoli, ATzouvelekis, LSTzelepi, EArlet, GMiriagou, V SCO-1, a novel plasmid-mediated class A beta-lactamase with carbenicillinase characteristics from Escherichia coli. Antimicrob Agents Chemother51:2185-8 (2007) 
 
Beta-lactamase TEM
Name:Beta-lactamase TEM
Type:Enzyme
Mol. Mass.:31512.33
Organism:Escherichia coli
Description:P62593
Residue:286
BDBM50021954
NameBDBM50021954
Synonyms:(2S,5R)-3,3-Dimethyl-4,4,7-trioxo-4lambda*6*-thia-1-aza-bicyclo[3.2.0]heptane-2-carboxylic acid 3,3-Dimethyl-4,4,7-trioxo-4lambda*6*-thia-1-aza-bicyclo[3.2.0]heptane-2-carboxylic acid CHEMBL403 SULBACTAM US20230322715, Compound ALK-09 | US9120808, Sulbactam sodium salt
TypeSmall organic molecule
Emp. Form.C8H11NO5S
Mol. Mass.233.242
SMILESCC1(C)[C@@H](N2[C@@H](CC2=O)S1(=O)=O)C(O)=O