Reaction Details
TargetATP-dependent translocase ABCB1
LigandBDBM50375810
Substrate/Competitorn/a
Meas. Tech.ChEMBL_474396 (CHEMBL939121)
IC50 300±n/a nM
Citation Müller, HPajeva, IKGlobisch, CWiese, M Functional assay and structure-activity relationships of new third-generation P-glycoprotein inhibitors. Bioorg Med Chem16:2448-62 (2008) 
 
ATP-dependent translocase ABCB1
Name:ATP-dependent translocase ABCB1
Type:PROTEIN
Mol. Mass.:141009.67
Organism:Mus musculus
Description:ChEMBL_474396
Residue:1276
BDBM50375810
NameBDBM50375810
Synonyms:CHEMBL346292 | XR-9456
TypeSmall organic molecule
Emp. Form.C33H33N3O4
Mol. Mass.535.6328
SMILESCOc1cc2CCN(CCc3ccc(NC(=O)c4ccccc4NC(=O)c4ccccc4)cc3)Cc2cc1OC