Reaction Details
TargetATP-dependent translocase ABCB1
LigandBDBM50075373
Substrate/Competitorn/a
Meas. Tech.ChEMBL_474396 (CHEMBL939121)
IC50 64±n/a nM
Citation Müller, HPajeva, IKGlobisch, CWiese, M Functional assay and structure-activity relationships of new third-generation P-glycoprotein inhibitors. Bioorg Med Chem16:2448-62 (2008) 
 
ATP-dependent translocase ABCB1
Name:ATP-dependent translocase ABCB1
Type:PROTEIN
Mol. Mass.:141009.67
Organism:Mus musculus
Description:ChEMBL_474396
Residue:1276
BDBM50075373
NameBDBM50075373
Synonyms:1N-{4-[2-(6,7-dimethoxy-1,2,3,4-tetrahydro-2-isoquinolinyl)ethyl]phenyl}-4,5-dimethoxy-2-(3-quinolylcarboxamido)benzamide N-(2-((4-(2-(6,7-dimethoxy-3,4-dihydroisoquinolin-2(1H)-yl)ethyl)phenyl)carbamoyl)-4,5-dimethoxyphenyl)quinoline-3-carboxamide US11739089, Compound Tariquidar
TypeSmall organic molecule
Emp. Form.C38H38N4O6
Mol. Mass.646.7315
SMILESCOc1cc2CCN(CCc3ccc(NC(=O)c4cc(OC)c(OC)cc4NC(=O)c4cnc5ccccc5c4)cc3)Cc2cc1OC