Reaction Details
TargetATP-dependent translocase ABCB1
LigandBDBM50375811
Substrate/Competitorn/a
Meas. Tech.ChEMBL_474393 (CHEMBL939120)
IC50 165.96±n/a nM
Citation Müller, HPajeva, IKGlobisch, CWiese, M Functional assay and structure-activity relationships of new third-generation P-glycoprotein inhibitors. Bioorg Med Chem16:2448-62 (2008) 
 
ATP-dependent translocase ABCB1
Name:ATP-dependent translocase ABCB1
Type:Protein
Mol. Mass.:141503.50
Organism:Homo sapiens (Human)
Description:P08183
Residue:1280
BDBM50375811
NameBDBM50375811
Synonyms:CHEMBL444075 | XR-9544
TypeSmall organic molecule
Emp. Form.C36H34N4O4
Mol. Mass.586.6796
SMILESCOc1cc2CCN(CCc3ccc(NC(=O)c4ccccc4NC(=O)c4cnc5ccccc5c4)cc3)Cc2cc1OC