Reaction Details
TargetProgesterone receptor
LigandBDBM50375818
Substrate/Competitorn/a
Meas. Tech.ChEMBL_474422 (CHEMBL934255)
IC50 10±n/a nM
Citation Fensome, AAdams, WRAdams, ALBerrodin, TJCohen, JHuselton, CIllenberger, AKern, JCHudak, VAMarella, MAMelenski, EGMcComas, CCMugford, CASlayden, ODYudt, MZhang, ZZhang, PZhu, YWinneker, RCWrobel, JE Design, synthesis, and SAR of new pyrrole-oxindole progesterone receptor modulators leading to 5-(7-fluoro-3,3-dimethyl-2-oxo-2,3-dihydro-1H-indol-5-yl)-1-methyl-1H-pyrrole-2-carbonitrile (WAY-255348). J Med Chem51:1861-73 (2008) 
 
Progesterone receptor
Name:Progesterone receptor
Type:Protein
Mol. Mass.:98979.52
Organism:Homo sapiens (Human)
Description:P06401
Residue:933
BDBM50375818
NameBDBM50375818
Synonyms:CHEMBL270908
TypeSmall organic molecule
Emp. Form.C16H15N3O
Mol. Mass.265.3098
SMILESCn1c(ccc1-c1ccc2NC(=O)C(C)(C)c2c1)C#N