Reaction Details
TargetProgesterone receptor
LigandBDBM50375827
Substrate/Competitorn/a
Meas. Tech.ChEMBL_474423 (CHEMBL934256)
IC50 4.1±n/a nM
Citation Fensome, AAdams, WRAdams, ALBerrodin, TJCohen, JHuselton, CIllenberger, AKern, JCHudak, VAMarella, MAMelenski, EGMcComas, CCMugford, CASlayden, ODYudt, MZhang, ZZhang, PZhu, YWinneker, RCWrobel, JE Design, synthesis, and SAR of new pyrrole-oxindole progesterone receptor modulators leading to 5-(7-fluoro-3,3-dimethyl-2-oxo-2,3-dihydro-1H-indol-5-yl)-1-methyl-1H-pyrrole-2-carbonitrile (WAY-255348). J Med Chem51:1861-73 (2008) 
 
Progesterone receptor
Name:Progesterone receptor
Type:Protein
Mol. Mass.:98979.52
Organism:Homo sapiens (Human)
Description:P06401
Residue:933
BDBM50375827
NameBDBM50375827
Synonyms:CHEMBL407848 | WAY-255348
TypeSmall organic molecule
Emp. Form.C16H14FN3O
Mol. Mass.283.3003
SMILESCn1c(ccc1-c1cc2c(NC(=O)C2(C)C)c(F)c1)C#N