Reaction Details
TargetCannabinoid receptor 1
LigandBDBM50375859
Substrate/Competitorn/a
Meas. Tech.ChEMBL_474602 (CHEMBL921108)
Ki 579±n/a nM
Citation Huffman, JWThompson, ALWiley, JLMartin, BR Synthesis and pharmacology of 1-deoxy analogs of CP-47,497 and CP-55,940. Bioorg Med Chem16:322-35 (2008) 
 
Cannabinoid receptor 1
Name:Cannabinoid receptor 1
Type:G Protein-Coupled Receptor (GPCR)
Mol. Mass.:52856.55
Organism:Rattus norvegicus (rat)
Description:P20272
Residue:473
BDBM50375859
NameBDBM50375859
Synonyms:CHEMBL264412 | JWH-325
TypeSmall organic molecule
Emp. Form.C22H36O2
Mol. Mass.332.52
SMILESCCCCC(C)(C)c1ccc(cc1)[C@@H]1C[C@H](O)CC[C@H]1CCCO