Reaction Details
TargetCannabinoid receptor 1
LigandBDBM50375862
Substrate/Competitorn/a
Meas. Tech.ChEMBL_474602 (CHEMBL921108)
Ki 266±n/a nM
Citation Huffman, JWThompson, ALWiley, JLMartin, BR Synthesis and pharmacology of 1-deoxy analogs of CP-47,497 and CP-55,940. Bioorg Med Chem16:322-35 (2008) 
 
Cannabinoid receptor 1
Name:Cannabinoid receptor 1
Type:G Protein-Coupled Receptor (GPCR)
Mol. Mass.:52856.55
Organism:Rattus norvegicus (rat)
Description:P20272
Residue:473
BDBM50375862
NameBDBM50375862
Synonyms:CHEMBL259723 | JWH-345
TypeSmall organic molecule
Emp. Form.C25H42O2
Mol. Mass.374.5998
SMILESCCCCCCCC(C)(C)c1ccc(cc1)[C@@H]1C[C@H](O)CC[C@H]1CCCO