Reaction Details
TargetCannabinoid receptor 1
LigandBDBM50375871
Substrate/Competitorn/a
Meas. Tech.ChEMBL_474602 (CHEMBL921108)
Ki>10000±n/a nM
Citation Huffman, JWThompson, ALWiley, JLMartin, BR Synthesis and pharmacology of 1-deoxy analogs of CP-47,497 and CP-55,940. Bioorg Med Chem16:322-35 (2008) 
 
Cannabinoid receptor 1
Name:Cannabinoid receptor 1
Type:G Protein-Coupled Receptor (GPCR)
Mol. Mass.:52856.55
Organism:Rattus norvegicus (rat)
Description:P20272
Residue:473
BDBM50375871
NameBDBM50375871
Synonyms:CHEMBL407763 | JWH-295
TypeSmall organic molecule
Emp. Form.C17H26O
Mol. Mass.246.3877
SMILESCCC(C)(C)c1ccc(cc1)[C@@H]1CCC[C@@H](O)C1