Reaction Details
TargetCannabinoid receptor 2
LigandBDBM50323907
Substrate/Competitorn/a
Meas. Tech.ChEMBL_474603 (CHEMBL921109)
Ki 231±n/a nM
Citation Huffman, JWThompson, ALWiley, JLMartin, BR Synthesis and pharmacology of 1-deoxy analogs of CP-47,497 and CP-55,940. Bioorg Med Chem16:322-35 (2008) 
 
Cannabinoid receptor 2
Name:Cannabinoid receptor 2
Type:G Protein-Coupled Receptor (GPCR)
Mol. Mass.:39690.94
Organism:Homo sapiens (Human)
Description:P34972
Residue:360
BDBM50323907
NameBDBM50323907
Synonyms:(1R*,3S*)-3-[4-(1,1-dimethylheptyl)phenyl]cyclohexanol CHEMBL263386 | JWH-324
TypeSmall organic molecule
Emp. Form.C21H34O
Mol. Mass.302.4941
SMILESCCCCCCC(C)(C)c1ccc(cc1)[C@H]1CCC[C@@H](O)C1