Reaction Details
TargetCannabinoid receptor 2
LigandBDBM50375876
Substrate/Competitorn/a
Meas. Tech.ChEMBL_474603 (CHEMBL921109)
Ki 639±n/a nM
Citation Huffman, JWThompson, ALWiley, JLMartin, BR Synthesis and pharmacology of 1-deoxy analogs of CP-47,497 and CP-55,940. Bioorg Med Chem16:322-35 (2008) 
 
Cannabinoid receptor 2
Name:Cannabinoid receptor 2
Type:G Protein-Coupled Receptor (GPCR)
Mol. Mass.:39690.94
Organism:Homo sapiens (Human)
Description:P34972
Residue:360
BDBM50375876
NameBDBM50375876
Synonyms:CHEMBL263399 | JWH-323
TypeSmall organic molecule
Emp. Form.C19H30O
Mol. Mass.274.4409
SMILESCCCCC(C)(C)c1ccc(cc1)[C@H]1CCC[C@@H](O)C1