Reaction Details
TargetGonadotropin-releasing hormone receptor
LigandBDBM50109237
Substrate/Competitorn/a
Meas. Tech.ChEMBL_474609 (CHEMBL921115)
Ki 44±n/a nM
Citation Feher, MGao, YBaber, JCShirley, WASaunders, J The use of ligand-based de novo design for scaffold hopping and sidechain optimization: two case studies. Bioorg Med Chem16:422-7 (2008) 
 
Gonadotropin-releasing hormone receptor
Name:Gonadotropin-releasing hormone receptor
Type:Enzyme
Mol. Mass.:37749.45
Organism:Homo sapiens (Human)
Description:P30968
Residue:328
BDBM50109237
NameBDBM50109237
Synonyms:6-[(Benzyl-methyl-amino)-methyl]-1-(2-fluoro-benzyl)-7-(4-isobutyrylamino-phenyl)-4-oxo-1,4-dihydro-pyrrolo[1,2-a]pyrimidine-3-carboxylic acid ethyl ester CHEMBL335610
TypeSmall organic molecule
Emp. Form.C36H37FN4O4
Mol. Mass.608.7018
SMILESCCOC(=O)c1cn(Cc2ccccc2F)c2cc(c(CN(C)Cc3ccccc3)n2c1=O)-c1ccc(NC(=O)C(C)C)cc1