Reaction Details
TargetGonadotropin-releasing hormone receptor
LigandBDBM50375883
Substrate/Competitorn/a
Meas. Tech.ChEMBL_474609 (CHEMBL921115)
Ki 21±n/a nM
Citation Feher, MGao, YBaber, JCShirley, WASaunders, J The use of ligand-based de novo design for scaffold hopping and sidechain optimization: two case studies. Bioorg Med Chem16:422-7 (2008) 
 
Gonadotropin-releasing hormone receptor
Name:Gonadotropin-releasing hormone receptor
Type:Enzyme
Mol. Mass.:37749.45
Organism:Homo sapiens (Human)
Description:P30968
Residue:328
BDBM50375883
NameBDBM50375883
Synonyms:CHEMBL260816
TypeSmall organic molecule
Emp. Form.C36H44N6O5
Mol. Mass.640.7718
SMILESCOc1ccc(CN2CC3CC(N4C(=O)N(CCN5CCOCC5)C(=O)C34C2)c2ccc(N(C)C)c3ccccc23)cc1NC(C)=O