Reaction Details
Target5-hydroxytryptamine receptor 2A
LigandBDBM50375900
Substrate/Competitorn/a
Meas. Tech.ChEMBL_474629 (CHEMBL936730)
Ki 10±n/a nM
Citation Shimada, IMaeno, KKondoh, YKaku, HSugasawa, KKimura, YHatanaka, KNaitou, YWanibuchi, FSakamoto, STsukamoto, S Synthesis and structure-activity relationships of a series of benzazepine derivatives as 5-HT2C receptor agonists. Bioorg Med Chem16:3309-20 (2008) 
 
5-hydroxytryptamine receptor 2A
Name:5-hydroxytryptamine receptor 2A
Type:undefined
Mol. Mass.:52607.65
Organism:Homo sapiens (Human)
Description:P28223
Residue:471
BDBM50375900
NameBDBM50375900
Synonyms:CHEMBL259480
TypeSmall organic molecule
Emp. Form.C10H11BrClN
Mol. Mass.260.558
SMILESClc1c(Br)ccc2CCNCCc12