Reaction Details
Target5-hydroxytryptamine receptor 2C
LigandBDBM50375903
Substrate/Competitorn/a
Meas. Tech.ChEMBL_474628 (CHEMBL936729)
Ki 8.8±n/a nM
Citation Shimada, IMaeno, KKondoh, YKaku, HSugasawa, KKimura, YHatanaka, KNaitou, YWanibuchi, FSakamoto, STsukamoto, S Synthesis and structure-activity relationships of a series of benzazepine derivatives as 5-HT2C receptor agonists. Bioorg Med Chem16:3309-20 (2008) 
 
5-hydroxytryptamine receptor 2C
Name:5-hydroxytryptamine receptor 2C
Type:G Protein-Coupled Receptor (GPCR)
Mol. Mass.:51836.79
Organism:Homo sapiens (Human)
Description:P28335
Residue:458
BDBM50375903
NameBDBM50375903
Synonyms:CHEMBL262862
TypeSmall organic molecule
Emp. Form.C10H11Cl2N
Mol. Mass.216.107
SMILESClc1ccc2CCNCCc2c1Cl