Reaction Details
TargetAurora kinase B
LigandBDBM50375997
Substrate/Competitorn/a
Meas. Tech.ChEMBL_474792 (CHEMBL951285)
IC50 130±n/a nM
Citation Weiss, MMHarmange, JCPolverino, AJBauer, DBerry, LBerry, VBorg, GBready, JChen, DChoquette, DCoxon, ADeMelfi, TDoerr, NEstrada, JFlynn, JGraceffa, RFHarriman, SPKaufman, SLa, DSLong, ANeervannan, SPatel, VFPotashman, MRegal, KRoveto, PMSchrag, MLStarnes, CTasker, ATeffera, YWhittington, DAZanon, R Evaluation of a series of naphthamides as potent, orally active vascular endothelial growth factor receptor-2 tyrosine kinase inhibitors. J Med Chem51:1668-80 (2008) 
 
Aurora kinase B
Name:Aurora kinase B
Type:Protein
Mol. Mass.:39327.72
Organism:Homo sapiens (Human)
Description:Q96GD4
Residue:344
BDBM50375997
NameBDBM50375997
Synonyms:CHEMBL272252
TypeSmall organic molecule
Emp. Form.C21H16N2O3
Mol. Mass.344.3633
SMILESCOc1ccc2c(Oc3ccc4c(cccc4c3)C(N)=O)ccnc2c1