Reaction Details
TargetAurora kinase A
LigandBDBM50375999
Substrate/Competitorn/a
Meas. Tech.ChEMBL_474791 (CHEMBL951284)
IC50 8300±n/a nM
Citation Weiss, MMHarmange, JCPolverino, AJBauer, DBerry, LBerry, VBorg, GBready, JChen, DChoquette, DCoxon, ADeMelfi, TDoerr, NEstrada, JFlynn, JGraceffa, RFHarriman, SPKaufman, SLa, DSLong, ANeervannan, SPatel, VFPotashman, MRegal, KRoveto, PMSchrag, MLStarnes, CTasker, ATeffera, YWhittington, DAZanon, R Evaluation of a series of naphthamides as potent, orally active vascular endothelial growth factor receptor-2 tyrosine kinase inhibitors. J Med Chem51:1668-80 (2008) 
 
Aurora kinase A
Name:Aurora kinase A
Type:Serine/threonine-protein kinase
Mol. Mass.:45830.98
Organism:Homo sapiens (Human)
Description:O14965
Residue:403
BDBM50375999
NameBDBM50375999
Synonyms:CHEMBL270342
TypeSmall organic molecule
Emp. Form.C24H20N2O3
Mol. Mass.384.4272
SMILESCOc1ccc2c(Oc3ccc4c(cccc4c3)C(=O)NC3CC3)ccnc2c1