Reaction Details
TargetTyrosine-protein kinase Fgr
LigandBDBM50236856
Substrate/Competitorn/a
Meas. Tech.ChEMBL_474822 (CHEMBL950239)
IC50 396±n/a nM
Citation Weiss, MMHarmange, JCPolverino, AJBauer, DBerry, LBerry, VBorg, GBready, JChen, DChoquette, DCoxon, ADeMelfi, TDoerr, NEstrada, JFlynn, JGraceffa, RFHarriman, SPKaufman, SLa, DSLong, ANeervannan, SPatel, VFPotashman, MRegal, KRoveto, PMSchrag, MLStarnes, CTasker, ATeffera, YWhittington, DAZanon, R Evaluation of a series of naphthamides as potent, orally active vascular endothelial growth factor receptor-2 tyrosine kinase inhibitors. J Med Chem51:1668-80 (2008) 
 
Tyrosine-protein kinase Fgr
Name:Tyrosine-protein kinase Fgr
Type:protein
Mol. Mass.:59469.88
Organism:Homo sapiens (Human)
Description:P09769
Residue:529
BDBM50236856
NameBDBM50236856
Synonyms:CHEMBL272198 N-cyclopropyl-6-[(6,7-dimethoxyquinolin-4-yl)oxy]naphthalene-1-carboxamide
TypeSmall organic molecule
Emp. Form.C25H22N2O4
Mol. Mass.414.4532
SMILESCOc1cc2nccc(Oc3ccc4c(cccc4c3)C(=O)NC3CC3)c2cc1OC