Reaction Details
TargetHepatocyte growth factor receptor
LigandBDBM50375995
Substrate/Competitorn/a
Meas. Tech.ChEMBL_474789 (CHEMBL951282)
IC50 7400±n/a nM
Citation Weiss, MMHarmange, JCPolverino, AJBauer, DBerry, LBerry, VBorg, GBready, JChen, DChoquette, DCoxon, ADeMelfi, TDoerr, NEstrada, JFlynn, JGraceffa, RFHarriman, SPKaufman, SLa, DSLong, ANeervannan, SPatel, VFPotashman, MRegal, KRoveto, PMSchrag, MLStarnes, CTasker, ATeffera, YWhittington, DAZanon, R Evaluation of a series of naphthamides as potent, orally active vascular endothelial growth factor receptor-2 tyrosine kinase inhibitors. J Med Chem51:1668-80 (2008) 
 
Hepatocyte growth factor receptor
Name:Hepatocyte growth factor receptor
Type:Protein
Mol. Mass.:155559.73
Organism:Homo sapiens (Human)
Description:P08581
Residue:1390
BDBM50375995
NameBDBM50375995
Synonyms:CHEMBL260532
TypeSmall organic molecule
Emp. Form.C22H17N3O4
Mol. Mass.387.3881
SMILESCOc1cc2nccc(Oc3ccc4c(cccc4c3)C(N)=O)c2cc1C(N)=O