Reaction Details
TargetHepatocyte growth factor receptor
LigandBDBM50376005
Substrate/Competitorn/a
Meas. Tech.ChEMBL_474789 (CHEMBL951282)
IC50 20000±n/a nM
Citation Weiss, MMHarmange, JCPolverino, AJBauer, DBerry, LBerry, VBorg, GBready, JChen, DChoquette, DCoxon, ADeMelfi, TDoerr, NEstrada, JFlynn, JGraceffa, RFHarriman, SPKaufman, SLa, DSLong, ANeervannan, SPatel, VFPotashman, MRegal, KRoveto, PMSchrag, MLStarnes, CTasker, ATeffera, YWhittington, DAZanon, R Evaluation of a series of naphthamides as potent, orally active vascular endothelial growth factor receptor-2 tyrosine kinase inhibitors. J Med Chem51:1668-80 (2008) 
 
Hepatocyte growth factor receptor
Name:Hepatocyte growth factor receptor
Type:Protein
Mol. Mass.:155559.73
Organism:Homo sapiens (Human)
Description:P08581
Residue:1390
BDBM50376005
NameBDBM50376005
Synonyms:CHEMBL271188
TypeSmall organic molecule
Emp. Form.C25H24N2O5
Mol. Mass.432.4685
SMILESCOCCNC(=O)c1cccc2cc(Oc3ccnc4cc(OC)c(OC)cc34)ccc12