Reaction Details
TargetVascular endothelial growth factor receptor 2
LigandBDBM50376008
Substrate/Competitorn/a
Meas. Tech.ChEMBL_474871 (CHEMBL932834)
IC50 5±n/a nM
Citation Harmange, JCWeiss, MMGermain, JPolverino, AJBorg, GBready, JChen, DChoquette, DCoxon, ADeMelfi, TDiPietro, LDoerr, NEstrada, JFlynn, JGraceffa, RFHarriman, SPKaufman, SLa, DSLong, AMartin, MWNeervannan, SPatel, VFPotashman, MRegal, KRoveto, PMSchrag, MLStarnes, CTasker, ATeffera, YWang, LWhite, RDWhittington, DAZanon, R Naphthamides as novel and potent vascular endothelial growth factor receptor tyrosine kinase inhibitors: design, synthesis, and evaluation. J Med Chem51:1649-67 (2008) 
 
Vascular endothelial growth factor receptor 2
Name:Vascular endothelial growth factor receptor 2
Type:Receptor Tyrosine Kinase
Mol. Mass.:151510.97
Organism:Homo sapiens (Human)
Description:P35968
Residue:1356
BDBM50376008
NameBDBM50376008
Synonyms:CHEMBL408211
TypeSmall organic molecule
Emp. Form.C25H24N2O4
Mol. Mass.416.4691
SMILESCOc1cc2nccc(Oc3ccc4c(cccc4c3)C(=O)NC(C)C)c2cc1OC