Reaction Details
TargetRAC-beta serine/threonine-protein kinase
LigandBDBM50376059
Substrate/Competitorn/a
Meas. Tech.ChEMBL_475113 (CHEMBL932635)
IC50 7±n/a nM
Citation Caldwell, JJDavies, TGDonald, AMcHardy, TRowlands, MGAherne, GWHunter, LKTaylor, KRuddle, RRaynaud, FIVerdonk, MWorkman, PGarrett, MDCollins, I Identification of 4-(4-aminopiperidin-1-yl)-7H-pyrrolo[2,3-d]pyrimidines as selective inhibitors of protein kinase B through fragment elaboration. J Med Chem51:2147-57 (2008) 
 
RAC-beta serine/threonine-protein kinase
Name:RAC-beta serine/threonine-protein kinase
Type:Enzyme
Mol. Mass.:55766.64
Organism:Homo sapiens (Human)
Description:n/a
Residue:481
BDBM50376059
NameBDBM50376059
Synonyms:CHEMBL259998
TypeSmall organic molecule
Emp. Form.C17H18ClN5
Mol. Mass.327.811
SMILESNC1(CCN(CC1)c1ncnc2[nH]ccc12)c1ccc(Cl)cc1