Reaction Details
TargetRAC-beta serine/threonine-protein kinase
LigandBDBM50376061
Substrate/Competitorn/a
Meas. Tech.ChEMBL_475113 (CHEMBL932635)
IC50 3±n/a nM
Citation Caldwell, JJDavies, TGDonald, AMcHardy, TRowlands, MGAherne, GWHunter, LKTaylor, KRuddle, RRaynaud, FIVerdonk, MWorkman, PGarrett, MDCollins, I Identification of 4-(4-aminopiperidin-1-yl)-7H-pyrrolo[2,3-d]pyrimidines as selective inhibitors of protein kinase B through fragment elaboration. J Med Chem51:2147-57 (2008) 
 
RAC-beta serine/threonine-protein kinase
Name:RAC-beta serine/threonine-protein kinase
Type:Enzyme
Mol. Mass.:55766.64
Organism:Homo sapiens (Human)
Description:n/a
Residue:481
BDBM50376061
NameBDBM50376061
Synonyms:CHEMBL409503
TypeSmall organic molecule
Emp. Form.C18H21ClN6
Mol. Mass.356.853
SMILESNCC1(Cc2ccc(Cl)cc2)CCN(CC1)c1ncnc2nc[nH]c12